Target
Type-1 angiotensin II receptor A/B
Ligand
BDBM50284663
Substrate
Meas. Tech.
ChEMBL_36644 (CHEMBL652354)
IC50
0.300000±n/a nM
Citation
 de Laszlo, SEChang, RSChen, TBFaust, KAGreenlee, WJKivlighn, SDLotti, VJO'Malley, SSSchorn, TWSchorn, TWSiegl, PKTran, JZingaro, GJ The SAR of 6-(N-alkyl-N-acyl)-2-propyl-3-[(2′-tetrazol-5-yl)biphen-4-yl)methyl]-quinazolinones as balanced affinity antagonists of the human AT1 and AT2 receptors Bioorg Med Chem Lett 5:1359-1364 (1995)    Article 
Target
Name:
Type-1 angiotensin II receptor A/B
Synonyms:
Angiotensin II receptor (AT-1) type-1 | Type-1A/Type-1B angiotensin II receptor
Type:
Mol. Mass.:
Description:
ASSAY_ID of ChEMBL is 901964
Components:
This complex has 2 components.
Component 1
Name:
Type-1 angiotensin II receptor B
Synonyms:
AGTRB_RAT Agtr1 Angiotensin II AT1B Angiotensin II type 1b (AT-1b) receptor Type-1B angiotensin II receptor
Type:
Enzyme Catalytic Domain
Mol. Mass.:
40929.44
Organism:
RAT
Description:
Angiotensin II AT1B 0 RAT::P29089
Residue:
359
  
Component 2
Name:
Type-1 angiotensin II receptor A
Synonyms:
AGTRA_RAT Agtr1 Angiotensin II AT1 Angiotensin II receptor (AT-1) type-1 Type-1A angiotensin II receptor
Type:
Enzyme Catalytic Domain
Mol. Mass.:
40910.53
Organism:
RAT
Description:
ANGIOTENSIN AT1 AGTR1 RAT::P25095
Residue:
359
  
Inhibitor
Name:
BDBM50284663
Synonyms:
CHEMBL282168 | N-Butyl-4-hydroxy-N-{3-[2'-(1-methyl-1H-tetrazol-5-yl)-biphenyl-4-ylmethyl]-4-oxo-3,4-dihydro-quinazolin-6-yl}-benzamide
Type:
Small organic molecule
Emp. Form.:
C34H31N7O3
Mol. Mass.:
585.655
SMILES:
CCCCN(C(=O)c1ccc(O)cc1)c1ccc2ncn(Cc3ccc(cc3)-c3ccccc3-c3nnnn3C)c(=O)c2c1
: