Target
Gag-Pol polyprotein [489-587]
Ligand
BDBM50284925
Substrate
Meas. Tech.
ChEMBL_157712 (CHEMBL763386)
Ki
24±n/a nM
Citation
 Ahmad, SAshfaq, AAlam, MBisacchi, GSChen, PCheng, PTGreytok, JAHermsmeier, MALin, PFLis, KAMerchant, ZMitt, TSkoog, MSpergel, SHTino, JAVite, GDColonno, RJZahler, RBarrish, JC α-hydroxyamide derived aminodiols as potent inhibitors of hiv protease Bioorg Med Chem Lett 5:1729-1734 (1995)    Article 
Target
Name:
Gag-Pol polyprotein [489-587]
Synonyms:
Human immunodeficiency virus type 1 protease Pol polyprotein | gag-pol
Type:
Enzyme Subunit
Mol. Mass.:
10781.16
Organism:
Human immunodeficiency virus type 1
Description:
P04585[489-587]
Residue:
99
  
Inhibitor
Name:
BDBM50284925
Synonyms:
CHEMBL288759 | {(1S,2R)-1-Benzyl-2-hydroxy-3-[(2R,3S)-2-hydroxy-3-((S)-2-hydroxy-2,3,3-trimethyl-butyrylamino)-4-phenyl-butylamino]-propyl}-carbamic acid tert-butyl ester
Type:
Small organic molecule
Emp. Form.:
C32H49N3O6
Mol. Mass.:
571.748
SMILES:
CC(C)(C)OC(=O)N[C@@H](Cc1ccccc1)[C@H](O)CNC[C@@H](O)[C@H](Cc1ccccc1)NC(=O)[C@@](C)(O)C(C)(C)C
: