Target
Gag-Pol polyprotein [489-587]
Ligand
BDBM50285698
Substrate
Meas. Tech.
ChEMBL_79978 (CHEMBL874137)
Ki
0.26±n/a nM
Citation
 Randad, RSLubkowska, LBujacz, ANaik, RHGulnik, SVYu, BSilva, AMunshi, SLynch, TMClanton, DJBhat, TNErickson, JW Structure-based design of achiral anthranilamides as P2/P2′ surrogates for symmetry-based HIV protease inhibitors: design, synthesis, X-ray structure, enzyme inhibition and antiviral activity Bioorg Med Chem Lett 5:2557-2562 (1995)    Article 
Target
Name:
Gag-Pol polyprotein [489-587]
Synonyms:
Human immunodeficiency virus type 1 protease Pol polyprotein | gag-pol
Type:
Enzyme Subunit
Mol. Mass.:
10781.16
Organism:
Human immunodeficiency virus type 1
Description:
P04585[489-587]
Residue:
99
  
Inhibitor
Name:
BDBM50285698
Synonyms:
Anthranilamide derivative | CHEMBL315500
Type:
Small organic molecule
Emp. Form.:
C46H44N6O7
Mol. Mass.:
792.8776
SMILES:
O[C@@H](C[C@H](Cc1ccccc1)NC(=O)c1ccccc1NC(=O)OCc1cccnc1)[C@H](Cc1ccccc1)NC(=O)c1ccccc1NC(=O)OCc1cccnc1
: