Target
Neuropeptide Y receptor type 1
Ligand
BDBM50287540
Substrate
Meas. Tech.
ChEBML_144144
Ki
>10000±n/a nM
Citation
 Wright, JBolton, GCreswell, MDowning, DGeorgic, LHeffner, THodges, JMacKenzie, RWise, L 8-amino-6-(arylsulphonyl)-5-nitroquinolines: novel nonpeptide neuropeptide Y1 receptor antagonists Bioorg Med Chem Lett 6:1809-1814 (1996)    Article 
Target
Name:
Neuropeptide Y receptor type 1
Synonyms:
NPY-Y1 NPY1R NPYR neuropeptide Y receptor Y1
Type:
Enzyme Catalytic Domain
Mol. Mass.:
44399.07
Organism:
Homo sapiens (Human)
Description:
NPY-Y1 NPY1R HUMAN::P25929
Residue:
384
  
Inhibitor
Name:
BDBM50287540
Synonyms:
CHEMBL54289 | N-(8-Amino-5-nitro-quinolin-6-yl)-benzenesulfonamide
Type:
Small organic molecule
Emp. Form.:
C15H12N4O4S
Mol. Mass.:
344.345
SMILES:
Nc1cc(NS(=O)(=O)c2ccccc2)c([N+]([O-])=O)c2cccnc12
: