Target
Prostatic acid phosphatase
Ligand
BDBM50288662
Substrate
Meas. Tech.
ChEBML_158626
IC50
31000±n/a nM
Citation
 Schwender, CFBeers, SAMalloy, EACinicola, JJWustrow, DJDemarest, KDJordan, J Benzylphosphonic acid inhibitors of human prostatic acid phosphatase Bioorg Med Chem Lett 6:311-314 (1996)    Article 
Target
Name:
Prostatic acid phosphatase
Synonyms:
ACP3 PPAP_HUMAN | Prostatic acid phosphatase
Type:
PROTEIN
Mol. Mass.:
44563.07
Organism:
Homo sapiens (Human)
Description:
ChEMBL_158625
Residue:
386
  
Inhibitor
Name:
BDBM50288662
Synonyms:
CHEMBL320504 | [(2-Chloro-phenyl)-phenyl-methyl]-phosphonic acid
Type:
Small organic molecule
Emp. Form.:
C13H12ClO3P
Mol. Mass.:
282.659
SMILES:
OP(O)(=O)C(c1ccccc1)c1ccccc1Cl
: