Target
Prostatic acid phosphatase
Ligand
BDBM50288663
Substrate
Meas. Tech.
ChEBML_158626
IC50
>100000±n/a nM
Citation
 Schwender, CFBeers, SAMalloy, EACinicola, JJWustrow, DJDemarest, KDJordan, J Benzylphosphonic acid inhibitors of human prostatic acid phosphatase Bioorg Med Chem Lett 6:311-314 (1996)    Article 
Target
Name:
Prostatic acid phosphatase
Synonyms:
ACP3 PPAP_HUMAN | Prostatic acid phosphatase
Type:
PROTEIN
Mol. Mass.:
44563.07
Organism:
Homo sapiens (Human)
Description:
ChEMBL_158625
Residue:
386
  
Inhibitor
Name:
BDBM50288663
Synonyms:
(9H-Thioxanthen-9-yl)-phosphonic acid | CHEMBL104341
Type:
Small organic molecule
Emp. Form.:
C13H11O3PS
Mol. Mass.:
278.263
SMILES:
OP(O)(O)=c1c2ccccc2sc2ccccc12
: