Target
Prostatic acid phosphatase
Ligand
BDBM50288665
Substrate
Meas. Tech.
ChEBML_158626
IC50
17000±n/a nM
Citation
 Schwender, CFBeers, SAMalloy, EACinicola, JJWustrow, DJDemarest, KDJordan, J Benzylphosphonic acid inhibitors of human prostatic acid phosphatase Bioorg Med Chem Lett 6:311-314 (1996)    Article 
Target
Name:
Prostatic acid phosphatase
Synonyms:
ACP3 PPAP_HUMAN | Prostatic acid phosphatase
Type:
PROTEIN
Mol. Mass.:
44563.07
Organism:
Homo sapiens (Human)
Description:
ChEMBL_158625
Residue:
386
  
Inhibitor
Name:
BDBM50288665
Synonyms:
CHEMBL322700 | [(3-Nitro-phenyl)-phenyl-methyl]-phosphonic acid
Type:
Small organic molecule
Emp. Form.:
C13H12NO5P
Mol. Mass.:
293.2118
SMILES:
OP(O)(=O)C(c1ccccc1)c1cccc(c1)[N+]([O-])=O
: