Target
Beta-1/Beta-2/Beta-3 adrenergic receptor
Ligand
BDBM50289291
Substrate
Meas. Tech.
ChEMBL_38572 (CHEMBL652074)
Ki
>10000±n/a nM
Citation
 Calligaro, DOFairhurst, JHotten, TMMoore, NATupper, DE The synthesis and biological activity of some known and putative metabolites of the atypical antipsychotic agent olanzapine (LY170053) Bioorg Med Chem Lett 7:25-30 (1997)    Article 
Target
Name:
Beta-1/Beta-2/Beta-3 adrenergic receptor
Synonyms:
Adrenergic receptor beta
Type:
Mol. Mass.:
Description:
ASSAY_ID of ChEMBL is 305577
Components:
This complex has 3 components.
Component 1
Name:
Beta-2 adrenergic receptor
Synonyms:
ADRB2 ADRB2_HUMAN Beta-2 adrenoceptor | Beta-2 adrenoreceptor
Type:
Mol. Mass.:
46461.69
Organism:
Homo sapiens (Human)
Description:
P07550
Residue:
413
  
Component 2
Name:
Beta-1 adrenergic receptor
Synonyms:
ADRB1 ADRB1_HUMAN Beta-1 adrenoceptor | adrenergic Beta1
Type:
G Protein-Coupled Receptor (GPCR)
Mol. Mass.:
51338.40
Organism:
Homo sapiens (Human)
Description:
P08588
Residue:
477
  
Component 3
Name:
Beta-3 adrenergic receptor
Synonyms:
ADRB3 ADRB3_HUMAN Beta-2 adrenergic receptor and beta-3 adrenergic receptor Beta-3 adrenoreceptor | adrenergic Beta3
Type:
G Protein-Coupled Receptor (GPCR)
Mol. Mass.:
43534.88
Organism:
Homo sapiens (Human)
Description:
Residue:
408
  
Inhibitor
Name:
BDBM50289291
Synonyms:
2-Hydroxy-methylolanzapine [10-(4-Methyl-piperazin-1-yl)-4H-3-thia-4,9-diaza-benzo[f]azulen-2-yl]-methanol
Type:
Small organic molecule
Emp. Form.:
C17H20N4OS
Mol. Mass.:
328.432
SMILES:
CN1CCN(CC1)C1=Nc2ccccc2Nc2sc(CO)cc12
: