Target
D(2) dopamine receptor
Ligand
BDBM50290033
Substrate
Meas. Tech.
ChEBML_58462
Ki
>2000±n/a nM
Citation
 Haworth, KEHarrison, TKulagowski, JJLeeson, PDOwens, APRidgill, MPTeall, MRFielding, MChapman, KEmms, FMarwood, RPatel, SMoss, KL 4-Heterocyclyl tetrahydropyridines as selective ligands for the human dopamine D4 receptor Bioorg Med Chem Lett 7:2211-2216 (1997)    Article 
Target
Name:
D(2) dopamine receptor
Synonyms:
D(2) dopamine receptor DOPAMINE D2 Long DRD2 Dopamine D2 receptor Dopamine D2 receptor (D2R) Dopamine2-like | d2
Type:
Cell-surface receptors
Mol. Mass.:
50647.10
Organism:
Homo sapiens (Human)
Description:
P14416
Residue:
443
  
Inhibitor
Name:
BDBM50290033
Synonyms:
2-[1-(2-Chloro-benzyl)-1,2,3,6-tetrahydro-pyridin-4-yl]-benzothiazole | CHEMBL67982
Type:
Small organic molecule
Emp. Form.:
C19H17ClN2S
Mol. Mass.:
340.87
SMILES:
Clc1ccccc1CN1CCC(=CC1)c1nc2ccccc2s1
: