Target
Substance-K receptor
Ligand
BDBM50290296
Substrate
Meas. Tech.
ChEBML_142720
IC50
2770±n/a nM
Citation
 Burkholder, TPKudlacz, EMMaynard, GDLiu, XGLe, TBWebster, MEHorgan, SWWenstrup, DLFreund, DWBoyer, FBratton, LGross, RSKnippenberg, RWLogan, DEJones, BKChen, TMGeary, JLCorrell, MAPoole, JCMandagere, AK Synthesis and structure-activity relationships for a series of substituted pyrrolidine NK1/NK2 receptor antagonists Bioorg Med Chem Lett 7:2531-2536 (1997)    Article 
Target
Name:
Substance-K receptor
Synonyms:
NK2R_MOUSE Tac2r | Tacr2
Type:
PROTEIN
Mol. Mass.:
43128.63
Organism:
Mus musculus
Description:
ChEMBL_142720
Residue:
384
  
Inhibitor
Name:
BDBM50290296
Synonyms:
1-{2-[3-(3,4-Dimethoxy-phenyl)-1-(3,4,5-trimethoxy-benzoyl)-pyrrolidin-3-yl]-ethyl}-4-phenyl-piperidine-4-carboxylic acid amide | CHEMBL85499
Type:
Small organic molecule
Emp. Form.:
C36H45N3O7
Mol. Mass.:
631.7584
SMILES:
COc1ccc(cc1OC)C1(CCN2CCC(CC2)(C(N)=O)c2ccccc2)CCN(C1)C(=O)c1cc(OC)c(OC)c(OC)c1
: