Target
Substance-K receptor
Ligand
BDBM50290299
Substrate
Meas. Tech.
ChEBML_142720
IC50
12±n/a nM
Citation
 Burkholder, TPKudlacz, EMMaynard, GDLiu, XGLe, TBWebster, MEHorgan, SWWenstrup, DLFreund, DWBoyer, FBratton, LGross, RSKnippenberg, RWLogan, DEJones, BKChen, TMGeary, JLCorrell, MAPoole, JCMandagere, AK Synthesis and structure-activity relationships for a series of substituted pyrrolidine NK1/NK2 receptor antagonists Bioorg Med Chem Lett 7:2531-2536 (1997)    Article 
Target
Name:
Substance-K receptor
Synonyms:
NK2R_MOUSE Tac2r | Tacr2
Type:
PROTEIN
Mol. Mass.:
43128.63
Organism:
Mus musculus
Description:
ChEMBL_142720
Residue:
384
  
Inhibitor
Name:
BDBM50290299
Synonyms:
1-{2-[3-(3,4-Dichloro-phenyl)-1-(3,4,5-trimethoxy-benzoyl)-pyrrolidin-3-yl]-ethyl}-4-phenyl-piperidine-4-carboxylic acid (2-morpholin-4-yl-ethyl)-amide | CHEMBL432183
Type:
Small organic molecule
Emp. Form.:
C40H50Cl2N4O6
Mol. Mass.:
753.754
SMILES:
COc1cc(cc(OC)c1OC)C(=O)N1CCC(CCN2CCC(CC2)(C(=O)NCCN2CCOCC2)c2ccccc2)(C1)c1ccc(Cl)c(Cl)c1
: