Target
Substance-K receptor
Ligand
BDBM50290300
Substrate
Meas. Tech.
ChEBML_142720
IC50
9.4±n/a nM
Citation
 Burkholder, TPKudlacz, EMMaynard, GDLiu, XGLe, TBWebster, MEHorgan, SWWenstrup, DLFreund, DWBoyer, FBratton, LGross, RSKnippenberg, RWLogan, DEJones, BKChen, TMGeary, JLCorrell, MAPoole, JCMandagere, AK Synthesis and structure-activity relationships for a series of substituted pyrrolidine NK1/NK2 receptor antagonists Bioorg Med Chem Lett 7:2531-2536 (1997)    Article 
Target
Name:
Substance-K receptor
Synonyms:
NK2R_MOUSE Tac2r | Tacr2
Type:
PROTEIN
Mol. Mass.:
43128.63
Organism:
Mus musculus
Description:
ChEMBL_142720
Residue:
384
  
Inhibitor
Name:
BDBM50290300
Synonyms:
(1-{2-[3-(3,4-Dichloro-phenyl)-1-(3,4,5-trimethoxy-benzoyl)-pyrrolidin-3-yl]-ethyl}-4-phenyl-piperidin-4-yl)-piperidin-1-yl-methanone | CHEMBL84055
Type:
Small organic molecule
Emp. Form.:
C39H47Cl2N3O5
Mol. Mass.:
708.714
SMILES:
COc1cc(cc(OC)c1OC)C(=O)N1CCC(CCN2CCC(CC2)(C(=O)N2CCCCC2)c2ccccc2)(C1)c1ccc(Cl)c(Cl)c1
: