Target
Substance-K receptor
Ligand
BDBM50290314
Substrate
Meas. Tech.
ChEBML_142720
IC50
17±n/a nM
Citation
 Burkholder, TPKudlacz, EMMaynard, GDLiu, XGLe, TBWebster, MEHorgan, SWWenstrup, DLFreund, DWBoyer, FBratton, LGross, RSKnippenberg, RWLogan, DEJones, BKChen, TMGeary, JLCorrell, MAPoole, JCMandagere, AK Synthesis and structure-activity relationships for a series of substituted pyrrolidine NK1/NK2 receptor antagonists Bioorg Med Chem Lett 7:2531-2536 (1997)    Article 
Target
Name:
Substance-K receptor
Synonyms:
NK2R_MOUSE Tac2r | Tacr2
Type:
PROTEIN
Mol. Mass.:
43128.63
Organism:
Mus musculus
Description:
ChEMBL_142720
Residue:
384
  
Inhibitor
Name:
BDBM50290314
Synonyms:
1-{2-[3-(3,4-Dichloro-phenyl)-1-(3,4,5-trimethoxy-benzoyl)-pyrrolidin-3-yl]-ethyl}-4-(3-methoxy-phenyl)-piperidine-4-carboxylic acid amide | CHEMBL315982
Type:
Small organic molecule
Emp. Form.:
C35H41Cl2N3O6
Mol. Mass.:
670.623
SMILES:
COc1cccc(c1)C1(CCN(CCC2(CCN(C2)C(=O)c2cc(OC)c(OC)c(OC)c2)c2ccc(Cl)c(Cl)c2)CC1)C(N)=O
: