Target
Calpain-1 catalytic subunit
Ligand
BDBM50291194
Substrate
Meas. Tech.
ChEBML_43860
IC50
10±n/a nM
Citation
 Iqbal, MMessina, PAFreed, BDas, MChatterjee, STripathy, RTao, MJosef, KADembofsky, BDunn, DGriffith, ESiman, RSenadhi, SEBiazzo, WBozyczko-Coyne, DMeyer, SLAtor, MABihovsky, R Subsite requirements for peptide aldehyde inhibitors of human calpain I Bioorg Med Chem Lett 7:539-544 (1997)    Article 
Target
Name:
Calpain-1 catalytic subunit
Synonyms:
CAN1_HUMAN CAPN1 Calpain-1 (u-Calpain) Calpain1
Type:
Protein
Mol. Mass.:
81880.51
Organism:
Homo sapiens (Human)
Description:
Residue:
714
  
Inhibitor
Name:
BDBM50291194
Synonyms:
(S)-2-Methanesulfonylamino-4-methyl-pentanoic acid ((S)-1-formyl-3-methyl-butyl)-amide | CHEMBL151536
Type:
Small organic molecule
Emp. Form.:
C13H26N2O4S
Mol. Mass.:
306.422
SMILES:
CC(C)C[C@H](NC(=O)[C@H](CC(C)C)NS(C)(=O)=O)C=O
: