Target
Calpain-1 catalytic subunit
Ligand
BDBM50291218
Substrate
Meas. Tech.
ChEBML_43860
IC50
10±n/a nM
Citation
 Iqbal, MMessina, PAFreed, BDas, MChatterjee, STripathy, RTao, MJosef, KADembofsky, BDunn, DGriffith, ESiman, RSenadhi, SEBiazzo, WBozyczko-Coyne, DMeyer, SLAtor, MABihovsky, R Subsite requirements for peptide aldehyde inhibitors of human calpain I Bioorg Med Chem Lett 7:539-544 (1997)    Article 
Target
Name:
Calpain-1 catalytic subunit
Synonyms:
CAN1_HUMAN CAPN1 Calpain-1 (u-Calpain) Calpain1
Type:
Protein
Mol. Mass.:
81880.51
Organism:
Homo sapiens (Human)
Description:
Residue:
714
  
Inhibitor
Name:
BDBM50291218
Synonyms:
CHEMBL2371036 | [(S)-1-(1-Formyl-propylcarbamoyl)-3-methyl-butyl]-carbamic acid benzyl ester
Type:
Small organic molecule
Emp. Form.:
C18H26N2O4
Mol. Mass.:
334.41
SMILES:
CC[C@H](NC(=O)[C@H](CC(C)C)NC(=O)OCc1ccccc1)C=O
: