Target
Calpain-1 catalytic subunit
Ligand
BDBM50291228
Substrate
Meas. Tech.
ChEBML_43860
IC50
8±n/a nM
Citation
 Iqbal, MMessina, PAFreed, BDas, MChatterjee, STripathy, RTao, MJosef, KADembofsky, BDunn, DGriffith, ESiman, RSenadhi, SEBiazzo, WBozyczko-Coyne, DMeyer, SLAtor, MABihovsky, R Subsite requirements for peptide aldehyde inhibitors of human calpain I Bioorg Med Chem Lett 7:539-544 (1997)    Article 
Target
Name:
Calpain-1 catalytic subunit
Synonyms:
CAN1_HUMAN CAPN1 Calpain-1 (u-Calpain) Calpain1
Type:
Protein
Mol. Mass.:
81880.51
Organism:
Homo sapiens (Human)
Description:
Residue:
714
  
Inhibitor
Name:
BDBM50291228
Synonyms:
CHEMBL347742 | [(S)-1-((S)-1-Formyl-3-methyl-butylcarbamoyl)-3-methyl-butyl]-carbamic acid 4-nitro-benzyl ester
Type:
Small organic molecule
Emp. Form.:
C20H29N3O6
Mol. Mass.:
407.4608
SMILES:
CC(C)C[C@H](NC(=O)[C@H](CC(C)C)NC(=O)OCc1ccc(cc1)[N+]([O-])=O)C=O
: