Target
Calpain-1 catalytic subunit
Ligand
BDBM50291234
Substrate
Meas. Tech.
ChEBML_43860
IC50
4±n/a nM
Citation
 Iqbal, MMessina, PAFreed, BDas, MChatterjee, STripathy, RTao, MJosef, KADembofsky, BDunn, DGriffith, ESiman, RSenadhi, SEBiazzo, WBozyczko-Coyne, DMeyer, SLAtor, MABihovsky, R Subsite requirements for peptide aldehyde inhibitors of human calpain I Bioorg Med Chem Lett 7:539-544 (1997)    Article 
Target
Name:
Calpain-1 catalytic subunit
Synonyms:
CAN1_HUMAN CAPN1 Calpain-1 (u-Calpain) Calpain1
Type:
Protein
Mol. Mass.:
81880.51
Organism:
Homo sapiens (Human)
Description:
Residue:
714
  
Inhibitor
Name:
BDBM50291234
Synonyms:
CHEMBL150600 | [(S)-1-((S)-1-Formyl-2-methyl-propylcarbamoyl)-3-methyl-butyl]-carbamic acid benzyl ester
Type:
Small organic molecule
Emp. Form.:
C19H28N2O4
Mol. Mass.:
348.4366
SMILES:
CC(C)C[C@H](NC(=O)OCc1ccccc1)C(=O)N[C@H](C=O)C(C)C
: