Target
Sodium-dependent dopamine transporter
Ligand
BDBM50292467
Substrate
Meas. Tech.
ChEMBL_507938 (CHEMBL952559)
IC50
3400±n/a nM
Citation
 Protais, PArbaoui, JBakkali, EHBermejo, ACortes, D Effects of Various Isoquinoline Alkaloids on In Vitro 3H-Dopamine Uptake by Rat Striatal Synaptosomes J Nat Prod 58:1475-1484 (1995)  
Target
Name:
Sodium-dependent dopamine transporter
Synonyms:
DA transporter SC6A3_RAT Sodium-dependent dopamine transporter | Sodium-dependent dopamine transporter (DAT)
Type:
Multi-pass membrane protein
Mol. Mass.:
68749.45
Organism:
Rattus norvegicus (rat)
Description:
P23977
Residue:
619
  
Inhibitor
Name:
BDBM50292467
Synonyms:
Antioquine CHEMBL446564 | CHEMBL452904
Type:
Small organic molecule
Emp. Form.:
C37H40N2O6
Mol. Mass.:
608.7233
SMILES:
COc1cc2CCN(C)[C@H]3Cc4ccc(OC)c(c4)-c4cc(C[C@H]5N(C)CCc6cc(OC)c(Oc(c1O)c23)cc56)ccc4O
: