Target
Cannabinoid receptor 1
Ligand
BDBM50292882
Substrate
Meas. Tech.
ChEMBL_494392 (CHEMBL941185)
Ki
2800±n/a nM
Citation
 Balas, LDurand, TSaha, SJohnson, IMukhopadhyay, S Total synthesis of photoactivatable or fluorescent anandamide probes: novel bioactive compounds with angiogenic activity. J Med Chem 52:1005-17 (2009)  
Target
Name:
Cannabinoid receptor 1
Synonyms:
CANN6 CB-R CNR CNR1_HUMAN Cannabinoid receptor Cannabinoid receptor 1 (brain)
Type:
G Protein-Coupled Receptor (GPCR)
Mol. Mass.:
52868.96
Organism:
Homo sapiens (Human)
Description:
P21554
Residue:
472
  
Inhibitor
Name:
BDBM50292882
Synonyms:
(3Z,6Z,9Z,12Z)-17-((R)-1-hydroxypropan-2-ylamino)-17-oxoheptadeca-3,6,9,12-tetraenyl 2-tert-butyl-2-methylbenzo[d][1,3]dioxole-4-carboxylate | CHEMBL513597
Type:
Small organic molecule
Emp. Form.:
C33H47NO6
Mol. Mass.:
553.7294
SMILES:
C[C@H](CO)NC(=O)CCC\C=C/C\C=C/C\C=C/C\C=C/CCOC(=O)c1cccc2OC(C)(Oc12)C(C)(C)C
: