Target
Cannabinoid receptor 1
Ligand
BDBM22988
Substrate
Meas. Tech.
ChEMBL_494392 (CHEMBL941185)
Ki
70±n/a nM
Citation
 Balas, LDurand, TSaha, SJohnson, IMukhopadhyay, S Total synthesis of photoactivatable or fluorescent anandamide probes: novel bioactive compounds with angiogenic activity. J Med Chem 52:1005-17 (2009)  
Target
Name:
Cannabinoid receptor 1
Synonyms:
CANN6 CB-R CNR CNR1_HUMAN Cannabinoid receptor Cannabinoid receptor 1 (brain)
Type:
G Protein-Coupled Receptor (GPCR)
Mol. Mass.:
52868.96
Organism:
Homo sapiens (Human)
Description:
P21554
Residue:
472
  
Inhibitor
Name:
BDBM22988
Synonyms:
(5Z,8Z,11Z,14Z)-N-(2-hydroxyethyl)icosa-5,8,11,14-tetraenamide ANANDAMIDE Arachidonoyl ethanolamide (AEA) Arachidonylethanolamide [14C]Anandamide | [3H]Anandamide
Type:
radiolabeled substrate
Emp. Form.:
C22H37NO2
Mol. Mass.:
347.5347
SMILES:
CCCCC\C=C/C\C=C/C\C=C/C\C=C/CCCC(=O)NCCO
: