Target
B2 bradykinin receptor
Ligand
BDBM50293885
Substrate
Meas. Tech.
ChEMBL_572639 (CHEMBL1026063)
IC50
43±n/a nM
Citation
 Gibson, CSchnatbaum, KPfeifer, JRLocardi, EPaschke, MReimer, URichter, UScharn, DFaussner, ATradler, T Novel small molecule bradykinin B2 receptor antagonists. J Med Chem 52:4370-9 (2009)  
Target
Name:
B2 bradykinin receptor
Synonyms:
B2 BRADYKININ B2R BK-2 receptor BKRB2_HUMAN | Bradykinin B2 receptor
Type:
Enzyme Catalytic Domain
Mol. Mass.:
44467.17
Organism:
Homo sapiens (Human)
Description:
B2 BRADYKININ BDKRB2 HUMAN::P30411
Residue:
391
  
Inhibitor
Name:
BDBM50293885
Synonyms:
8-((3-chloro-5-(1-methyl-1H-imidazol-2-ylthio)pyridin-4-yl)methoxy)-2-methyl-4-(1-methyl-1H-pyrazol-5-yl)quinoline | CHEMBL551759
Type:
Small organic molecule
Emp. Form.:
C24H21ClN6OS
Mol. Mass.:
476.981
SMILES:
Cc1cc(-c2ccnn2C)c2cccc(OCc3c(Cl)cncc3Sc3nccn3C)c2n1
: