Target
B2 bradykinin receptor
Ligand
BDBM50293892
Substrate
Meas. Tech.
ChEMBL_572639 (CHEMBL1026063)
IC50
12±n/a nM
Citation
 Gibson, CSchnatbaum, KPfeifer, JRLocardi, EPaschke, MReimer, URichter, UScharn, DFaussner, ATradler, T Novel small molecule bradykinin B2 receptor antagonists. J Med Chem 52:4370-9 (2009)  
Target
Name:
B2 bradykinin receptor
Synonyms:
B2 BRADYKININ B2R BK-2 receptor BKRB2_HUMAN | Bradykinin B2 receptor
Type:
Enzyme Catalytic Domain
Mol. Mass.:
44467.17
Organism:
Homo sapiens (Human)
Description:
B2 BRADYKININ BDKRB2 HUMAN::P30411
Residue:
391
  
Inhibitor
Name:
BDBM50293892
Synonyms:
CHEMBL552090 | dimethyl-carbamic acid 5-chloro-4-[2-methyl-4-(2-methyl-2H-pyrazol-3-yl)-quinolin-8-yloxymethyl]-pyridin-3-ylmethyl ester
Type:
Small organic molecule
Emp. Form.:
C24H24ClN5O3
Mol. Mass.:
465.932
SMILES:
CN(C)C(=O)OCc1cncc(Cl)c1COc1cccc2c(cc(C)nc12)-c1ccnn1C
: