Target
B2 bradykinin receptor
Ligand
BDBM50293899
Substrate
Meas. Tech.
ChEMBL_572639 (CHEMBL1026063)
IC50
1.4±n/a nM
Citation
 Gibson, CSchnatbaum, KPfeifer, JRLocardi, EPaschke, MReimer, URichter, UScharn, DFaussner, ATradler, T Novel small molecule bradykinin B2 receptor antagonists. J Med Chem 52:4370-9 (2009)  
Target
Name:
B2 bradykinin receptor
Synonyms:
B2 BRADYKININ B2R BK-2 receptor BKRB2_HUMAN | Bradykinin B2 receptor
Type:
Enzyme Catalytic Domain
Mol. Mass.:
44467.17
Organism:
Homo sapiens (Human)
Description:
B2 BRADYKININ BDKRB2 HUMAN::P30411
Residue:
391
  
Inhibitor
Name:
BDBM50293899
Synonyms:
1-{5-chloro-4-[2-methyl-4-(2-methyl-2H-pyrazol-3-yl)-quinolin-8-yloxymethyl]-pyridin-3-ylmethyl}-3-trifluoromethyl-1H-pyridin-2-one | CHEMBL559436
Type:
Small organic molecule
Emp. Form.:
C27H21ClF3N5O2
Mol. Mass.:
539.936
SMILES:
Cc1cc(-c2ccnn2C)c2cccc(OCc3c(Cl)cncc3Cn3cccc(c3=O)C(F)(F)F)c2n1
: