Target
B2 bradykinin receptor
Ligand
BDBM50067301
Substrate
Meas. Tech.
ChEMBL_572637 (CHEMBL1026061)
IC50
1.4±n/a nM
Citation
 Gibson, CSchnatbaum, KPfeifer, JRLocardi, EPaschke, MReimer, URichter, UScharn, DFaussner, ATradler, T Novel small molecule bradykinin B2 receptor antagonists. J Med Chem 52:4370-9 (2009)  
Target
Name:
B2 bradykinin receptor
Synonyms:
B2 BRADYKININ B2R BK-2 receptor BKRB2_HUMAN | Bradykinin B2 receptor
Type:
Enzyme Catalytic Domain
Mol. Mass.:
44467.17
Organism:
Homo sapiens (Human)
Description:
B2 BRADYKININ BDKRB2 HUMAN::P30411
Residue:
391
  
Inhibitor
Name:
BDBM50067301
Synonyms:
(E)-3-(6-Acetylamino-pyridin-3-yl)-N-({[2,4-dichloro-3-(2-methyl-quinolin-8-yloxymethyl)-phenyl]-methyl-carbamoyl}-methyl)-acrylamide CHEMBL130517 | FK-3657
Type:
Small organic molecule
Emp. Form.:
C30H27Cl2N5O4
Mol. Mass.:
592.472
SMILES:
CN(C(=O)CNC(=O)\C=C\c1ccc(NC(C)=O)nc1)c1ccc(Cl)c(COc2cccc3ccc(C)nc23)c1Cl
: