Target
B2 bradykinin receptor
Ligand
BDBM50293887
Substrate
Meas. Tech.
ChEMBL_572637 (CHEMBL1026061)
IC50
37±n/a nM
Citation
 Gibson, CSchnatbaum, KPfeifer, JRLocardi, EPaschke, MReimer, URichter, UScharn, DFaussner, ATradler, T Novel small molecule bradykinin B2 receptor antagonists. J Med Chem 52:4370-9 (2009)  
Target
Name:
B2 bradykinin receptor
Synonyms:
B2 BRADYKININ B2R BK-2 receptor BKRB2_HUMAN | Bradykinin B2 receptor
Type:
Enzyme Catalytic Domain
Mol. Mass.:
44467.17
Organism:
Homo sapiens (Human)
Description:
B2 BRADYKININ BDKRB2 HUMAN::P30411
Residue:
391
  
Inhibitor
Name:
BDBM50293887
Synonyms:
2-{5-chloro-4-[2-methyl-4-(2-methyl-2H-pyrazol-3-yl)-quinolin-8-yloxymethyl]-pyridine-3-sulfinyl}-N,N-dimethyl-acetamide | CHEMBL563068
Type:
Small organic molecule
Emp. Form.:
C24H24ClN5O3S
Mol. Mass.:
497.997
SMILES:
CN(C)C(=O)CS(=O)c1cncc(Cl)c1COc1cccc2c(cc(C)nc12)-c1ccnn1C
: