Target
B2 bradykinin receptor
Ligand
BDBM50293891
Substrate
Meas. Tech.
ChEMBL_572637 (CHEMBL1026061)
IC50
6.6±n/a nM
Citation
 Gibson, CSchnatbaum, KPfeifer, JRLocardi, EPaschke, MReimer, URichter, UScharn, DFaussner, ATradler, T Novel small molecule bradykinin B2 receptor antagonists. J Med Chem 52:4370-9 (2009)  
Target
Name:
B2 bradykinin receptor
Synonyms:
B2 BRADYKININ B2R BK-2 receptor BKRB2_HUMAN | Bradykinin B2 receptor
Type:
Enzyme Catalytic Domain
Mol. Mass.:
44467.17
Organism:
Homo sapiens (Human)
Description:
B2 BRADYKININ BDKRB2 HUMAN::P30411
Residue:
391
  
Inhibitor
Name:
BDBM50293891
Synonyms:
3-{5-chloro-4-[2-methyl-4-(2-methyl-2H-pyrazol-3-yl)-quinolin-8-yloxymethyl]-pyridin-3-ylmethyl}-1,1-dimethyl-urea | CHEMBL563878
Type:
Small organic molecule
Emp. Form.:
C24H25ClN6O2
Mol. Mass.:
464.947
SMILES:
CN(C)C(=O)NCc1cncc(Cl)c1COc1cccc2c(cc(C)nc12)-c1ccnn1C
: