Target
B2 bradykinin receptor
Ligand
BDBM50293895
Substrate
Meas. Tech.
ChEMBL_572637 (CHEMBL1026061)
IC50
6±n/a nM
Citation
 Gibson, CSchnatbaum, KPfeifer, JRLocardi, EPaschke, MReimer, URichter, UScharn, DFaussner, ATradler, T Novel small molecule bradykinin B2 receptor antagonists. J Med Chem 52:4370-9 (2009)  
Target
Name:
B2 bradykinin receptor
Synonyms:
B2 BRADYKININ B2R BK-2 receptor BKRB2_HUMAN | Bradykinin B2 receptor
Type:
Enzyme Catalytic Domain
Mol. Mass.:
44467.17
Organism:
Homo sapiens (Human)
Description:
B2 BRADYKININ BDKRB2 HUMAN::P30411
Residue:
391
  
Inhibitor
Name:
BDBM50293895
Synonyms:
CHEMBL562296 | acetic acid 5-chloro-4-[2-methyl-4-(2-methyl-2H-pyrazol-3-yl)-quinolin-8-yloxymethyl]-pyridin-3-ylmethyl ester
Type:
Small organic molecule
Emp. Form.:
C23H19ClN4O3
Mol. Mass.:
434.875
SMILES:
CC(=O)OCc1cncc(Cl)c1C(=O)c1cccc2c(cc(C)nc12)-c1ccnn1C
: