Target
B2 bradykinin receptor
Ligand
BDBM50293903
Substrate
Meas. Tech.
ChEMBL_572637 (CHEMBL1026061)
IC50
10±n/a nM
Citation
 Gibson, CSchnatbaum, KPfeifer, JRLocardi, EPaschke, MReimer, URichter, UScharn, DFaussner, ATradler, T Novel small molecule bradykinin B2 receptor antagonists. J Med Chem 52:4370-9 (2009)  
Target
Name:
B2 bradykinin receptor
Synonyms:
B2 BRADYKININ B2R BK-2 receptor BKRB2_HUMAN | Bradykinin B2 receptor
Type:
Enzyme Catalytic Domain
Mol. Mass.:
44467.17
Organism:
Homo sapiens (Human)
Description:
B2 BRADYKININ BDKRB2 HUMAN::P30411
Residue:
391
  
Inhibitor
Name:
BDBM50293903
Synonyms:
1-((3-((4-(5-chlorothiazol-4-yl)-2-methylquinolin-8-yloxy)methyl)-4-methylpyridin-2-yl)methyl)-3-(trifluoromethyl)pyridin-2(1H)-one | CHEMBL549534
Type:
Small organic molecule
Emp. Form.:
C27H20ClF3N4O2S
Mol. Mass.:
556.987
SMILES:
Cc1cc(-c2ncsc2Cl)c2cccc(OCc3c(C)ccnc3Cn3cccc(c3=O)C(F)(F)F)c2n1
: