Target
B2 bradykinin receptor
Ligand
BDBM50293866
Substrate
Meas. Tech.
ChEMBL_572637 (CHEMBL1026061)
IC50
32±n/a nM
Citation
 Gibson, CSchnatbaum, KPfeifer, JRLocardi, EPaschke, MReimer, URichter, UScharn, DFaussner, ATradler, T Novel small molecule bradykinin B2 receptor antagonists. J Med Chem 52:4370-9 (2009)  
Target
Name:
B2 bradykinin receptor
Synonyms:
B2 BRADYKININ B2R BK-2 receptor BKRB2_HUMAN | Bradykinin B2 receptor
Type:
Enzyme Catalytic Domain
Mol. Mass.:
44467.17
Organism:
Homo sapiens (Human)
Description:
B2 BRADYKININ BDKRB2 HUMAN::P30411
Residue:
391
  
Inhibitor
Name:
BDBM50293866
Synonyms:
8-(3,5-dichloro-pyridin-4-ylmethoxy)-2-methyl-4-pyrazol-1-yl-quinoline | CHEMBL562747
Type:
Small organic molecule
Emp. Form.:
C19H14Cl2N4O
Mol. Mass.:
385.247
SMILES:
Cc1cc(-n2cccn2)c2cccc(OCc3c(Cl)cncc3Cl)c2n1
: