Target
B2 bradykinin receptor
Ligand
BDBM50293871
Substrate
Meas. Tech.
ChEMBL_572637 (CHEMBL1026061)
IC50
68±n/a nM
Citation
 Gibson, CSchnatbaum, KPfeifer, JRLocardi, EPaschke, MReimer, URichter, UScharn, DFaussner, ATradler, T Novel small molecule bradykinin B2 receptor antagonists. J Med Chem 52:4370-9 (2009)  
Target
Name:
B2 bradykinin receptor
Synonyms:
B2 BRADYKININ B2R BK-2 receptor BKRB2_HUMAN | Bradykinin B2 receptor
Type:
Enzyme Catalytic Domain
Mol. Mass.:
44467.17
Organism:
Homo sapiens (Human)
Description:
B2 BRADYKININ BDKRB2 HUMAN::P30411
Residue:
391
  
Inhibitor
Name:
BDBM50293871
Synonyms:
8-(3,5-dichloro-pyridin-4-ylmethoxy)-2-methyl-4-(2-methyl-2H-[1,2,4]triazol-3-yl)-quinoline | CHEMBL563254
Type:
Small organic molecule
Emp. Form.:
C19H15Cl2N5O
Mol. Mass.:
400.261
SMILES:
Cc1cc(-c2ncnn2C)c2cccc(OCc3c(Cl)cncc3Cl)c2n1
: