Target
B2 bradykinin receptor
Ligand
BDBM50293876
Substrate
Meas. Tech.
ChEMBL_572637 (CHEMBL1026061)
IC50
80±n/a nM
Citation
 Gibson, CSchnatbaum, KPfeifer, JRLocardi, EPaschke, MReimer, URichter, UScharn, DFaussner, ATradler, T Novel small molecule bradykinin B2 receptor antagonists. J Med Chem 52:4370-9 (2009)  
Target
Name:
B2 bradykinin receptor
Synonyms:
B2 BRADYKININ B2R BK-2 receptor BKRB2_HUMAN | Bradykinin B2 receptor
Type:
Enzyme Catalytic Domain
Mol. Mass.:
44467.17
Organism:
Homo sapiens (Human)
Description:
B2 BRADYKININ BDKRB2 HUMAN::P30411
Residue:
391
  
Inhibitor
Name:
BDBM50293876
Synonyms:
8-(3,5-dichloro-pyridin-4-ylmethoxy)-2-methyl-4-thiazol-4-yl-quinoline | CHEMBL550143
Type:
Small organic molecule
Emp. Form.:
C19H13Cl2N3OS
Mol. Mass.:
402.297
SMILES:
Cc1cc(-c2cscn2)c2cccc(OCc3c(Cl)cncc3Cl)c2n1
: