Target
Dipeptidyl peptidase 4
Ligand
BDBM11559
Substrate
Meas. Tech.
ChEMBL_579503 (CHEMBL1058857)
IC50
90±n/a nM
Citation
 Nordhoff, SCerezo-Gálvez, SDeppe, HHill, OLópez-Canet, MRummey, CThiemann, MMatassa, VGEdwards, PJFeurer, A Discovery of beta-homophenylalanine based pyrrolidin-2-ylmethyl amides and sulfonamides as highly potent and selective inhibitors of dipeptidyl peptidase IV. Bioorg Med Chem Lett 19:4201-3 (2009)  
Target
Name:
Dipeptidyl peptidase 4
Synonyms:
ADABP Adenosine deaminase complexing protein 2 CD_antigen=CD26 DPP4 DPPIV Dipeptidyl peptidase 4 (DPP IV) Dipeptidyl peptidase 4 (DPP4) Dipeptidyl peptidase 4 membrane form Dipeptidyl peptidase IV Dipeptidyl peptidase IV (DDP-IV) Dipeptidyl peptidase IV membrane form Dipeptidyl peptidase-IV (DPP-4) T-cell activation antigen CD26 | TP103
Type:
Enzyme
Mol. Mass.:
88271.01
Organism:
Homo sapiens (Human)
Description:
P27487
Residue:
766
  
Inhibitor
Name:
BDBM11559
Synonyms:
N-({(2S)-1-[(3R)-3-amino-4-(2-fluorophenyl)butanoyl]pyrrolidin-2-yl}methyl)benzamide REVERSED AMIDE 9
Type:
Small organic molecule
Emp. Form.:
C22H26FN3O2
Mol. Mass.:
383.4591
SMILES:
N[C@@H](CC(=O)N1CCC[C@H]1CNC(=O)c1ccccc1)Cc1ccccc1F
: