Target
Potassium voltage-gated channel subfamily H member 2
Ligand
BDBM50296937
Substrate
Meas. Tech.
ChEMBL_580850 (CHEMBL1064182)
Ki
46±n/a nM
Citation
 Mitchell, HJDankulich, WPHartman, GDPrueksaritanont, TSchmidt, AVogel, RLBai, CMcElwee-Witmer, SZhang, HZChen, FLeu, CTKimmel, DBRay, WJNantermet, PGentile, MADuggan, MEMeissner, RS Design, synthesis, and biological evaluation of 16-substituted 4-azasteroids as tissue-selective androgen receptor modulators (SARMs). J Med Chem 52:4578-81 (2009)  
Target
Name:
Potassium voltage-gated channel subfamily H member 2
Synonyms:
1,3-beta-glucan synthase component GLS2 ERG Eag-related protein 1 Ether-a-go-go-related gene (HERG) Ether-a-go-go-related gene potassium channel 1 Ether-a-go-go-related gene potassium channel 1 (hERG1) Ether-a-go-go-related protein 1 H-ERG KCNH2 Potassium voltage-gated channel subfamily H member 2 (hERG) Voltage-gated potassium channel subunit Kv11.1 hERG Potassium Channel 1 | putative potassium channel subunit
Type:
Multi-pass membrane protein
Mol. Mass.:
126672.65
Organism:
Homo sapiens (Human)
Description:
Q12809
Residue:
1159
  
Inhibitor
Name:
BDBM50296937
Synonyms:
16-[(3,5-Difluorophenyl)methylidene]-17beta-hydroxy-4-methyl-4-aza-5alpha-androst-1-en-3-one | CHEMBL556431
Type:
Small organic molecule
Emp. Form.:
C26H31F2NO2
Mol. Mass.:
427.5266
SMILES:
CN1[C@@H]2CC[C@H]3[C@@H]4C\C(=C/c5cc(F)cc(F)c5)[C@H](O)[C@@]4(C)CC[C@@H]3[C@@]2(C)C=CC1=O
: