Target
cAMP-specific 3',5'-cyclic phosphodiesterase 4D
Ligand
BDBM50299569
Substrate
Meas. Tech.
ChEMBL_591880 (CHEMBL1045950)
IC50
1910±n/a nM
Citation
 Bruno, ORomussi, ASpallarossa, ABrullo, CSchenone, SBondavalli, FVanthuyne, NRoussel, C New selective phosphodiesterase 4D inhibitors differently acting on long, short, and supershort isoforms. J Med Chem 52:6546-57 (2009)  
Target
Name:
cAMP-specific 3',5'-cyclic phosphodiesterase 4D
Synonyms:
3',5'-cyclic phosphodiesterase PDE43 PDE4D_HUMAN | Phosphodiesterase 4D
Type:
Protein
Mol. Mass.:
91092.69
Organism:
Homo sapiens (Human)
Description:
Q08499
Residue:
809
  
Inhibitor
Name:
BDBM50299569
Synonyms:
3-(cyclopentyloxy)-4-methoxybenzaldehyde O-[2-(2,6-dimethylmorpholin-4-yl)-2-oxoethyl]oxime | CHEMBL570803
Type:
Small organic molecule
Emp. Form.:
C21H30N2O5
Mol. Mass.:
390.4733
SMILES:
COc1ccc(\C=N\OCC(=O)N2CC(C)OC(C)C2)cc1OC1CCCC1
: