Target
cAMP-specific 3',5'-cyclic phosphodiesterase 4D
Ligand
BDBM50299570
Substrate
Meas. Tech.
ChEMBL_591873 (CHEMBL1045943)
IC50
3480±n/a nM
Citation
 Bruno, ORomussi, ASpallarossa, ABrullo, CSchenone, SBondavalli, FVanthuyne, NRoussel, C New selective phosphodiesterase 4D inhibitors differently acting on long, short, and supershort isoforms. J Med Chem 52:6546-57 (2009)  
Target
Name:
cAMP-specific 3',5'-cyclic phosphodiesterase 4D
Synonyms:
3',5'-cyclic phosphodiesterase PDE43 PDE4D_HUMAN | Phosphodiesterase 4D
Type:
Protein
Mol. Mass.:
91092.69
Organism:
Homo sapiens (Human)
Description:
Q08499
Residue:
809
  
Inhibitor
Name:
BDBM50299570
Synonyms:
3-(Cyclopentyloxy)-4-methoxybenzaldehyde O-(2-Morpholin-4-yl-2-oxoethyl)oxime | CHEMBL572539
Type:
Small organic molecule
Emp. Form.:
C19H26N2O5
Mol. Mass.:
362.4201
SMILES:
COc1ccc(\C=N\OCC(=O)N2CCOCC2)cc1OC1CCCC1
: