Target
cAMP-specific 3',5'-cyclic phosphodiesterase 4D
Ligand
BDBM50299568
Substrate
Meas. Tech.
ChEMBL_591886 (CHEMBL1045956)
Ki
3860±n/a nM
Citation
 Bruno, ORomussi, ASpallarossa, ABrullo, CSchenone, SBondavalli, FVanthuyne, NRoussel, C New selective phosphodiesterase 4D inhibitors differently acting on long, short, and supershort isoforms. J Med Chem 52:6546-57 (2009)  
Target
Name:
cAMP-specific 3',5'-cyclic phosphodiesterase 4D
Synonyms:
3',5'-cyclic phosphodiesterase PDE43 PDE4D_HUMAN | Phosphodiesterase 4D
Type:
Protein
Mol. Mass.:
91092.69
Organism:
Homo sapiens (Human)
Description:
Q08499
Residue:
809
  
Inhibitor
Name:
BDBM50299568
Synonyms:
3-(Cyclopentyloxy)-4-methoxybenzaldehyde O-[3-(2,6-Dimethyl-morpholin-4-yl)-2-hydroxypropyl]-oxime | CHEMBL569624
Type:
Small organic molecule
Emp. Form.:
C22H34N2O5
Mol. Mass.:
406.5158
SMILES:
COc1ccc(\C=N\OCC(O)CN2CC(C)OC(C)C2)cc1OC1CCCC1
: