Target
Proprotein convertase subtilisin/kexin type 7
Ligand
BDBM50303778
Substrate
Meas. Tech.
ChEMBL_597566 (CHEMBL1049703)
Ki
>10000±n/a nM
Citation
 Becker, GLSielaff, FThan, MELindberg, IRouthier, SDay, RLu, YGarten, WSteinmetzer, T Potent inhibitors of furin and furin-like proprotein convertases containing decarboxylated P1 arginine mimetics. J Med Chem 53:1067-75 (2010)  
Target
Name:
Proprotein convertase subtilisin/kexin type 7
Synonyms:
LPC PC7 PCSK7 Prohormone convertase PC7 Proprotein convertase subtilisin/kexin type 7 Subtilisin/kexin type 7 hPC8
Type:
PROTEIN
Mol. Mass.:
86233.43
Organism:
Homo sapiens (Human)
Description:
ChEMBL_1290739
Residue:
785
  
Inhibitor
Name:
BDBM50303778
Synonyms:
(S)-N-((1-carbamimidoylpiperidin-4-yl)methyl)-5-guanidino-2-((S)-2-((S)-5-guanidino-2-(2-phenylacetamido)pentanamido)-3-methylbutanamido)pentanamide | CHEMBL568067
Type:
Small organic molecule
Emp. Form.:
C32H55N13O4
Mol. Mass.:
685.8638
SMILES:
[#6]-[#6](-[#6])-[#6@H](-[#7]-[#6](=O)-[#6@H](-[#6]-[#6]-[#6]\[#7]=[#6](/[#7])-[#7])-[#7]-[#6](=O)-[#6]-c1ccccc1)-[#6](=O)-[#7]-[#6@@H](-[#6]-[#6]-[#6]\[#7]=[#6](/[#7])-[#7])-[#6](=O)-[#7]-[#6]-[#6]-1-[#6]-[#6]-[#7](-[#6]-[#6]-1)-[#6](-[#7])=[#7]
: