Target
Lysophosphatidic acid receptor 2
Ligand
BDBM50271765
Substrate
Meas. Tech.
ChEMBL_605120 (CHEMBL1073934)
IC50
9±n/a nM
Citation
 Fells, JITsukahara, RLiu, JTigyi, GParrill, AL Structure-based drug design identifies novel LPA3 antagonists. Bioorg Med Chem 17:7457-64 (2009)  
Target
Name:
Lysophosphatidic acid receptor 2
Synonyms:
EDG4 LPA-2 LPAR2 Lysophosphatidic acid receptor 2 | Lysophosphatidic acid receptor Edg-4
Type:
PROTEIN
Mol. Mass.:
39103.44
Organism:
Homo sapiens (Human)
Description:
ChEMBL_1451385
Residue:
351
  
Inhibitor
Name:
BDBM50271765
Synonyms:
3-(4-{3-[4-(3-Carboxy-acryloylamino)-phenoxy]-phenoxy}-phenylcarbamoyl)-acrylic acid CHEMBL482498
Type:
Small organic molecule
Emp. Form.:
C26H20N2O8
Mol. Mass.:
488.4456
SMILES:
OC(=O)\C=C\C(=O)Nc1ccc(Oc2cccc(Oc3ccc(NC(=O)\C=C\C(O)=O)cc3)c2)cc1
: