Target
Kappa-type opioid receptor
Ligand
BDBM50305085
Substrate
Meas. Tech.
ChEMBL_603076 (CHEMBL1048559)
Ki
>5000±n/a nM
Citation
 Li, WTao, YMTang, YXu, XJChen, JFu, WWang, XHChao, BSheng, WXie, QQiu, ZBLiu, JG Highly selective and potent mu opioid ligands by unexpected substituent on morphine skeleton. Bioorg Med Chem Lett 20:418-21 (2010)  
Target
Name:
Kappa-type opioid receptor
Synonyms:
K-OR-1 Kappa-opioid receptor (KOR) Kappa-type opioid receptor (KOR) OPIATE Kappa OPRK1 kappa opioid receptor (KOR)
Type:
G Protein-Coupled Receptor (GPCR)
Mol. Mass.:
42648.76
Organism:
Homo sapiens (Human)
Description:
P41145
Residue:
380
  
Inhibitor
Name:
BDBM50305085
Synonyms:
8alpha-phenyl-6alpha,14alpha-endo-Ethenotetrahydrothebaine | CHEMBL594124
Type:
Small organic molecule
Emp. Form.:
C27H29NO3
Mol. Mass.:
415.5241
SMILES:
COc1ccc2C[C@H]3N(C)CC[C@@]45[C@@H](Oc1c24)[C@]1(C[C@@H](c2ccccc2)[C@]35C=C1)OC
: