Target
Kappa-type opioid receptor
Ligand
BDBM50305088
Substrate
Meas. Tech.
ChEMBL_603076 (CHEMBL1048559)
Ki
10000±n/a nM
Citation
 Li, WTao, YMTang, YXu, XJChen, JFu, WWang, XHChao, BSheng, WXie, QQiu, ZBLiu, JG Highly selective and potent mu opioid ligands by unexpected substituent on morphine skeleton. Bioorg Med Chem Lett 20:418-21 (2010)  
Target
Name:
Kappa-type opioid receptor
Synonyms:
K-OR-1 Kappa-opioid receptor (KOR) Kappa-type opioid receptor (KOR) OPIATE Kappa OPRK1 kappa opioid receptor (KOR)
Type:
G Protein-Coupled Receptor (GPCR)
Mol. Mass.:
42648.76
Organism:
Homo sapiens (Human)
Description:
P41145
Residue:
380
  
Inhibitor
Name:
BDBM50305088
Synonyms:
22-nitro-7apha-phenyl-6alpha,14alpha-endo-Ethenotetrahydrothebaine | CHEMBL606343
Type:
Small organic molecule
Emp. Form.:
C27H28N2O5
Mol. Mass.:
460.5216
SMILES:
COc1ccc2C[C@H]3N(C)CC[C@@]45[C@@H](Oc1c24)[C@]1(OC)C=C[C@@]35C[C@@H]1c1ccc(cc1)[N+]([O-])=O
: