Target
Mu-type opioid receptor
Ligand
BDBM50305087
Substrate
Meas. Tech.
ChEMBL_603079 (CHEMBL1048562)
EC50
302.3±n/a nM
Citation
 Li, WTao, YMTang, YXu, XJChen, JFu, WWang, XHChao, BSheng, WXie, QQiu, ZBLiu, JG Highly selective and potent mu opioid ligands by unexpected substituent on morphine skeleton. Bioorg Med Chem Lett 20:418-21 (2010)  
Target
Name:
Mu-type opioid receptor
Synonyms:
MOR-1 Mu-type opioid receptor (MOR) OPRM_RAT Opioid receptor B Ror-b
Type:
G Protein-Coupled Receptor (GPCR)
Mol. Mass.:
44503.11
Organism:
Rattus norvegicus (rat)
Description:
Competition binding assays were carried out using membrane preparations from transfected HN9.10 cells that constitutively expressed the mu opioid receptor.
Residue:
398
  
Inhibitor
Name:
BDBM50305087
Synonyms:
21-nitro-8alpha-phenyl-6alpha,14alpha-endo-Ethenotetrahydrothebaine | CHEMBL594787
Type:
Small organic molecule
Emp. Form.:
C27H28N2O5
Mol. Mass.:
460.5216
SMILES:
COc1ccc2C[C@H]3N(C)CC[C@@]45[C@@H](Oc1c24)[C@]1(C[C@@H](c2cccc(c2)[N+]([O-])=O)[C@]35C=C1)OC
: