Target
Acetylcholinesterase
Ligand
BDBM50307926
Substrate
Meas. Tech.
ChEMBL_608062 (CHEMBL1072132)
IC50
56700±n/a nM
Citation
 Alptüzün, VPrinz, MHörr, VScheiber, JRadacki, KFallarero, AVuorela, PEngels, BBraunschweig, HErciyas, EHolzgrabe, U Interaction of (benzylidene-hydrazono)-1,4-dihydropyridines with beta-amyloid, acetylcholine, and butyrylcholine esterases. Bioorg Med Chem 18:2049-59 (2010)  
Target
Name:
Acetylcholinesterase
Synonyms:
ACES_ELEEL Acetylcholinesterase (EeAChE) | ache
Type:
Enzyme
Mol. Mass.:
71812.79
Organism:
Electrophorus electricus (Electric eel)
Description:
Residue:
633
  
Inhibitor
Name:
BDBM50307926
Synonyms:
4-((2,6-dichlorobenzylidene)hydrazono)-1-phenethyl-1,4-dihydropyridine | CHEMBL610507
Type:
Small organic molecule
Emp. Form.:
C20H17Cl2N3
Mol. Mass.:
370.275
SMILES:
Clc1cccc(Cl)c1\C=N\N=c1ccn(CCc2ccccc2)cc1
: