Target
Cholinesterase
Ligand
BDBM50307921
Substrate
Meas. Tech.
ChEMBL_608063 (CHEMBL1072133)
IC50
1830±n/a nM
Citation
 Alptüzün, VPrinz, MHörr, VScheiber, JRadacki, KFallarero, AVuorela, PEngels, BBraunschweig, HErciyas, EHolzgrabe, U Interaction of (benzylidene-hydrazono)-1,4-dihydropyridines with beta-amyloid, acetylcholine, and butyrylcholine esterases. Bioorg Med Chem 18:2049-59 (2010)  
Target
Name:
Cholinesterase
Synonyms:
BCHE CHLE_HORSE | Cholinesterase
Type:
Enzyme
Mol. Mass.:
65643.35
Organism:
Equus caballus (Horse)
Description:
P81908
Residue:
574
  
Inhibitor
Name:
BDBM50307921
Synonyms:
(E,E)-1,3-bis[4-[[(2,6-dichlorobenzyloxyl)imino]methyl]pyridinium]propane. dibromide CHEMBL590603
Type:
Small organic molecule
Emp. Form.:
C29H26Cl4N4O2
Mol. Mass.:
604.353
SMILES:
Clc1cccc(Cl)c1CO\N=C\c1cc[n+](CCC[n+]2ccc(\C=N\OCc3c(Cl)cccc3Cl)cc2)cc1
: