Target
Cholinesterase
Ligand
BDBM50041517
Substrate
Meas. Tech.
ChEMBL_608063 (CHEMBL1072133)
IC50
2780±n/a nM
Citation
 Alptüzün, VPrinz, MHörr, VScheiber, JRadacki, KFallarero, AVuorela, PEngels, BBraunschweig, HErciyas, EHolzgrabe, U Interaction of (benzylidene-hydrazono)-1,4-dihydropyridines with beta-amyloid, acetylcholine, and butyrylcholine esterases. Bioorg Med Chem 18:2049-59 (2010)  
Target
Name:
Cholinesterase
Synonyms:
BCHE CHLE_HORSE | Cholinesterase
Type:
Enzyme
Mol. Mass.:
65643.35
Organism:
Equus caballus (Horse)
Description:
P81908
Residue:
574
  
Inhibitor
Name:
BDBM50041517
Synonyms:
4-[(2,6-dichloro-benzyloxyimino)-methyl]-1-(3-phenyl-propyl)-pyridinium CHEMBL610796
Type:
Small organic molecule
Emp. Form.:
C22H21Cl2N2O
Mol. Mass.:
400.32
SMILES:
Clc1cccc(Cl)c1CO\N=C\c1cc[n+](CCCc2ccccc2)cc1
: