Target
Cholinesterase
Ligand
BDBM50307924
Substrate
Meas. Tech.
ChEMBL_608063 (CHEMBL1072133)
IC50
11000±n/a nM
Citation
 Alptüzün, VPrinz, MHörr, VScheiber, JRadacki, KFallarero, AVuorela, PEngels, BBraunschweig, HErciyas, EHolzgrabe, U Interaction of (benzylidene-hydrazono)-1,4-dihydropyridines with beta-amyloid, acetylcholine, and butyrylcholine esterases. Bioorg Med Chem 18:2049-59 (2010)  
Target
Name:
Cholinesterase
Synonyms:
BCHE CHLE_HORSE | Cholinesterase
Type:
Enzyme
Mol. Mass.:
65643.35
Organism:
Equus caballus (Horse)
Description:
P81908
Residue:
574
  
Inhibitor
Name:
BDBM50307924
Synonyms:
4-((2,6-dichlorobenzylidene)hydrazono)-1-methyl-1,4-dihydropyridine | CHEMBL598649
Type:
Small organic molecule
Emp. Form.:
C13H11Cl2N3
Mol. Mass.:
280.153
SMILES:
Cn1ccc(cc1)=N\N=C\c1c(Cl)cccc1Cl
: