Target
Platelet-derived growth factor receptor beta
Ligand
BDBM47167
Substrate
Meas. Tech.
ChEMBL_609784 (CHEMBL1070751)
IC50
1867±n/a nM
Citation
 Ilovich, OBillauer, HDotan, SMishani, E Labeled 3-aryl-4-indolylmaleimide derivatives and their potential as angiogenic PET biomarkers. Bioorg Med Chem 18:612-20 (2010)  
Target
Name:
Platelet-derived growth factor receptor beta
Synonyms:
Beta-type platelet-derived growth factor receptor CD140b antigen PDGF Receptor Substrate PDGFR PDGFR-1 PDGFRB PGFRB_HUMAN Platelet-derived growth factor receptor 1 Platelet-derived growth factor receptor beta (PDGFR-beta) Platelet-derived growth factor receptor beta (PDGFRbeta) | VHL/PDGFRB
Type:
Enzyme
Mol. Mass.:
123922.25
Organism:
Homo sapiens (Human)
Description:
P09619
Residue:
1106
  
Inhibitor
Name:
BDBM47167
Synonyms:
CHEMBL201511 US9364459, A
Type:
Emp. Form.:
C21H18N2O5
Mol. Mass.:
378.378
SMILES:
COc1cc(cc(OC)c1OC)C1=C(C(=O)NC1=O)c1c[nH]c2ccccc12
: