Target
Low molecular weight protein-tyrosine phosphatase A
Ligand
BDBM50312261
Substrate
Meas. Tech.
ChEMBL_621991 (CHEMBL1106782)
Ki
1400±n/a nM
Citation
 Rawls, KALang, PTTakeuchi, JImamura, SBaguley, TDGrundner, CAlber, TEllman, JA Fragment-based discovery of selective inhibitors of the Mycobacterium tuberculosis protein tyrosine phosphatase PtpA. Bioorg Med Chem Lett 19:6851-4 (2009)  
Target
Name:
Low molecular weight protein-tyrosine phosphatase A
Synonyms:
PTPA_MYCTU Probable low molecular weight protein-tyrosine-phosphatase mptpA | ptpA
Type:
Hydrolase
Mol. Mass.:
17891.84
Organism:
Mycobacterium tuberculosis
Description:
Residue:
163
  
Inhibitor
Name:
BDBM50312261
Synonyms:
(4-(4-bromo-3,5-bis(trifluoromethyl)phenylcarbamoyl)phenyl)difluoromethylphosphonic acid | CHEMBL1081579
Type:
Small organic molecule
Emp. Form.:
C16H9BrF8NO4P
Mol. Mass.:
542.112
SMILES:
OP(O)(=O)C(F)(F)c1ccc(cc1)C(=O)Nc1cc(c(Br)c(c1)C(F)(F)F)C(F)(F)F
: