Target
IgG receptor FcRn large subunit p51
Ligand
BDBM50314084
Substrate
Meas. Tech.
ChEMBL_627629 (CHEMBL1114459)
IC50
600±n/a nM
Citation
 McDonnell, KALow, SCHoehn, TDonnelly, RPalmieri, HFraley, CSakorafas, PMezo, AR Synthesis and structure-activity relationships of dimeric peptide antagonists of the human immunoglobulin G-human neonatal Fc receptor (IgG-FcRn) interaction. J Med Chem 53:1587-96 (2010)  
Target
Name:
IgG receptor FcRn large subunit p51
Synonyms:
FCGRN_HUMAN FCRN
Type:
PROTEIN
Mol. Mass.:
39742.86
Organism:
Homo sapiens (Human)
Description:
ChEMBL_627631
Residue:
365
  
Inhibitor
Name:
BDBM50314084
Synonyms:
CHEMBL1089952
Type:
Small organic molecule
Emp. Form.:
C187H262N50O50S2
Mol. Mass.:
4074.516
SMILES:
CC(C)C[C@@H]1N(C)C(=O)CN(C)C(=O)CNC(=O)[C@H](Cc2ccccc2)NC(=O)[C@H](Cc2cnc[nH]2)NC(=O)CNC(=O)[C@@H](NC(=O)[C@H](CC(=O)NCCCC[C@H](NC(=O)[C@@H]2CCCN2C(=O)C(=O)[C@H](Cc2ccc(O)cc2)NC1=O)C(=O)N[C@@H](CC(N)=O)C(=O)NCC(=O)N1CCC[C@H]1C(N)=O)NC(=O)[C@H](Cc1ccccc1)NC(=O)CSCCC(=O)NCCCN(CCCNC(=O)CCSCC(=O)N[C@@H](CCC(N)=O)C(=O)N[C@@H](CCCNC(N)=N)C(=O)N[C@@H](Cc1ccccc1)C(=O)N[C@H]1CC(=O)NCCCC[C@H](NC(=O)[C@@H]2CCCN2C(=O)C(=O)[C@H](Cc2ccc(O)cc2)NC(=O)[C@H](CC(C)C)N(C)C(=O)CN(C)C(=O)CNC(=O)[C@H](Cc2ccccc2)NC(=O)[C@H](Cc2cnc[nH]2)NC(=O)CNC(=O)[C@@H](NC1=O)[C@@H](C)O)C(=O)N[C@@H](CC(N)=O)C(=O)NCC(=O)N1CCC[C@H]1C(N)=O)CC(=O)NCC(O)=O)[C@@H](C)O
: