Target
IgG receptor FcRn large subunit p51
Ligand
BDBM50314099
Substrate
Meas. Tech.
ChEMBL_627629 (CHEMBL1114459)
IC50
5±n/a nM
Citation
 McDonnell, KALow, SCHoehn, TDonnelly, RPalmieri, HFraley, CSakorafas, PMezo, AR Synthesis and structure-activity relationships of dimeric peptide antagonists of the human immunoglobulin G-human neonatal Fc receptor (IgG-FcRn) interaction. J Med Chem 53:1587-96 (2010)  
Target
Name:
IgG receptor FcRn large subunit p51
Synonyms:
FCGRN_HUMAN FCRN
Type:
PROTEIN
Mol. Mass.:
39742.86
Organism:
Homo sapiens (Human)
Description:
ChEMBL_627631
Residue:
365
  
Inhibitor
Name:
BDBM50314099
Synonyms:
CHEMBL1090637 | N1,N5-bis((S)-1-((S)-1-((3R,8R,11S,17S,20S,29S,32S,38aS)-17-((1H-imidazol-4-yl)methyl)-20-benzyl-3-carbamoyl-32-(4-hydroxybenzyl)-11-((R)-1-hydroxyethyl)-29-isobutyl-7,7,25,28-tetramethyl-1,9,12,15,18,21,24,27,30,33,34-undecaoxohexatriacontahydropyrrolo[2,1-g][1,2,5,8,12,15,18,21,24,27,30,33]dithiadecaazacyclohexatriacontin-8-ylamino)-1-oxo-3-phenylpropan-2-ylamino)-5-guanidino-1-oxopentan-2-yl)-3,3-dimethylpentanediamide
Type:
Small organic molecule
Emp. Form.:
C149H206N38O34S4
Mol. Mass.:
3201.724
SMILES:
CC(C)C[C@@H]1N(C)C(=O)CN(C)C(=O)CNC(=O)[C@H](Cc2ccccc2)NC(=O)[C@H](Cc2cnc[nH]2)NC(=O)CNC(=O)[C@@H](NC(=O)[C@@H](NC(=O)[C@H](Cc2ccccc2)NC(=O)[C@H](CCCNC(N)=N)NC(=O)CC(C)(C)CC(=O)N[C@@H](CCCNC(N)=N)C(=O)N[C@@H](Cc2ccccc2)C(=O)N[C@@H]2C(=O)N[C@@H]([C@@H](C)O)C(=O)NCC(=O)N[C@@H](Cc3cnc[nH]3)C(=O)N[C@@H](Cc3ccccc3)C(=O)NCC(=O)N(C)CC(=O)N(C)[C@@H](CC(C)C)C(=O)N[C@@H](Cc3ccc(O)cc3)C(=O)C(=O)N3CCC[C@H]3C(=O)N[C@@H](CSSC2(C)C)C(N)=O)C(C)(C)SSC[C@H](NC(=O)[C@@H]2CCCN2C(=O)C(=O)[C@H](Cc2ccc(O)cc2)NC1=O)C(N)=O)[C@@H](C)O
: