Target
Prostaglandin E2 receptor EP3 subtype
Ligand
BDBM50315503
Substrate
Meas. Tech.
ChEMBL_626787 (CHEMBL1107234)
IC50
0.3±n/a nM
Citation
 Zhou, NPolozov, AMO'Connell, MBurgeson, JYu, PZeller, WZhang, JOnua, ERamirez, JPalsdottir, GAHalldorsdottir, GVAndresson, TKiselyov, ASGurney, MSingh, J 1,7-Disubstituted oxyindoles are potent and selective EP(3) receptor antagonists. Bioorg Med Chem Lett 20:2658-64 (2010)  
Target
Name:
Prostaglandin E2 receptor EP3 subtype
Synonyms:
PE2R3_HUMAN PGE2-R Prostaglandin E2 receptor Prostaglandin E2 receptor EP3 subtype (EP3) Prostaglandin E2 receptor EP3D subtype (EP3D) | Prostanoid EP3 receptor
Type:
Enzyme
Mol. Mass.:
43335.03
Organism:
Homo sapiens (Human)
Description:
P43115
Residue:
390
  
Inhibitor
Name:
BDBM50315503
Synonyms:
CHEMBL1092871 | N-(3,4-dichlorophenylsulfonyl)-3-(1-(3,4-difluorobenzyl)-2-oxoindolin-7-yl)acrylamide
Type:
Small organic molecule
Emp. Form.:
C24H16Cl2F2N2O4S
Mol. Mass.:
537.363
SMILES:
Fc1ccc(CN2C(=O)Cc3cccc(\C=C\C(=O)NS(=O)(=O)c4ccc(Cl)c(Cl)c4)c23)cc1F
: